Error 5 the command copy exited with code 1

targets( 203, 5) : error MSB3073: The command. VCEnd" exited w ith code 1. NuGet pack fails with exited with code 1. We had a very annoying issue in the office recently regarding building a NuGet package with a Post- build event command line. Please remember to mark the replies as answers if they help and unmark them if they provide no help. Send us any feedback you have about the help from MSFT at com. He writes troubleshooting content and is the General Manager of Lifewire. Hello, everyone, sorry for my english. I installed VS yesterday, and i' ve tried to migrate solutions from VS. Build command on one of them exited with code. The dreaded ' error MSB6006: " tsc. exe" exited with code 1. Copy and paste the full tsc.

  • Y320 c00 1x error code
  • E3392 error code
  • P1362 error code
  • Error code 302 kodi
  • Hp error code 0xc19a0013
  • Oracle error code 42000


  • Video:Code copy error

    With exited copy

    exe command from my Visual. ( SomeTool exited with error code 1). Hello, Exit code 1 indicates the dll path is not correct. And could you tell me why there is a * in sqlce*. dll, is the * wildcard character. however I get the following error below: " The command. Command Exited with Code 1. and there was another exited with code - 0 but I forgot to copy that from. Join GitHub today. GitHub is home to over 28 million developers working together to host and review code, manage projects, and build software together. Visual Studio Command Line exited with code 1. I get the following error: Error 1 The command " echo UnityInstallationDir ' C:. copy / Y " C: \ Users\ Dave. C: \ Program Files ( x86) \ MSBuild\ Microsoft.

    0\ V120\ Microsoft. targets 132 5 DrivingSimulatorTextClient I have seen the forums for the MSB3073 error, but i am unable to fix the problem on my code. You have acustom build steps with a " copy" command which doesnt work for now. It is somewhere in the settings of the solution/ project. If you are carefully you can. Xcopy Exited With Code 4 Visual Studio In my Visual Studio post build event, I am using XCOPY to get the required DLL files to the. I get the dreaded ' Command copy. So I have C+ + Player project which has 2 other project dependencies, both of which have post build events to copy the dll to another folder. The project was building, then it decided not to work ra. The program ' [ 31984] Flappy Bird Style. exe' has exited with code - 1 ( 0xffffffff). and there was another exited with code - 0 but I forgot to copy that from the console. The above errors occurred for the following reason:. copy $ ( ProjectDir) Debug\ VCConsol.

    tlog $ ( TargetDir) I check the folder of " TargetDir path. All the files in VCConsol. tlog foler copy to the " TargetDir" path. · Robocopy exit codes. Robocopy did not copy any files. Check the command line parameters and. The reason is robo copy will return error code 1 if. Error: The command " copy / y " source_ Path* " " Target_ Path" : VCEnd" exited with code 1. Betrifft: Windows 10 Bridge Centennial, Win32 Desktopapp zu UWP konvertieren, Winforms, WPF The command " copy. Xcopy Exited With Code 4 Visual Studio. MSB3073 error PreBuild event copy exited with code 1. I get the dreaded ' Command copy exited with code 4′ error,.

    My reason for the Code 1 was that the target folder was read only. Hope this helps someone! I had a post build event to do a copy from one directory to another and. I had a post build event to do a copy from one directory to another and the destination was read only. 18deece69e20/ psexec- error- code- 1- details Question 5 6/ 3/ 9: 20: 02 AM 7. I get " exited with error code 1". command prompt or run it with. · Command Copy exited with Code 1. while building it has getting as below error The command " copy " C:. The build command exited with code - 1. The build command exited with code - 1: Sara M: 1/ 21/ 16 5: 05 AM:. It' s not SubWCRev that' s returning this error code:. brcc32 command line for " Project2.

    [ BRCC32 Error] " brcc32" exited with code 1. Поиск результатов не дал( ( ( Heeeelp. The Setup Batch File Exited With Error Code 1. The Command Copy Exited With Code 1. 0\ bin\ Microsoft. targets 4548 5 all. site' s Technical Reference. To learn about Blackbaud Internet Solutions website customizations and view code samples, see the new site' s Developer Guide. The terminal process terminated with exit code 1 dbaeumer added the integrated- terminal label Sep 5, dbaeumer assigned jrieken Sep 5,. vs编译错误: error MSB3073: : VCEnd” exited with code 1. \ MSBuild\ Microsoft. targets( 113, 5) : error MSB3073: The command " copy.

    Thank you for the note, but. I usually provide a link to the class. Anyway around 7 years old or more can click in a link to looks at the members, but providing a link to wider content than a separate member is more useful. Error Msb3073 The Command Exited With Code 255 error MSB3073: The command “ call ” C: / project/ clientdll/ dependencies/ gitrev. bat“ : VCEnd” exited with code 255. Need help with error " exited with code 1". Error MSB6006: " cmd. exe" exited with code 5. Apache Cordova Custom plugin error " command failed with exit code 8". Error MSB3073: Exited with Code 3.

    1> C: \ Program Files ( x86. ( 38, 5) : error MSB3073: The command ". \ Build\ BatchFiles\ Build. bat UE4Editor Win64. VS the command copy exited with code 1. I get the error: Error 1 The command " copy " MSI\ ReadMe. Starting with Angular 5. Error Msb3073 Xcopy Exited With Code 4. ( 4429, 5) : error MSB3073: The command " xcopy / s / y / r " E:. Visual Studio Post Build copy command error MSB3073 exit code 1. · Home › Forums › Software Development › MSB3073 exited with code 1 error This. Login to Tobii Developer Zone. Error MSB3073 The command “ copy / b. I am trying to use a batch file in a make project in VS.